{"text_format":"1","workbook":"xlsx","n_sheets":4,"sheets":["Blanket","Ark1","Alias","Testark"],"not_rendered":{"charts":0,"images":1,"macros":1,"external_links":0,"defined_names":2,"comments":0,"pivot_tables":0},"unopened":[],"bounds":{"document_bytes":16777216,"sheet_cells":100000,"rows_first":2000,"rows_last":500,"rows_between":2000,"halvings":0,"cell_chars":16384,"cell_head_chars":4096},"cells_cut":0,"cells_raw":0,"read":"whole","date_system":"1900"}

{"sheet":"Blanket","index":0,"n_rows":59,"n_cols":9,"rows_kept":59,"cut":false,"hidden":false,"merged":[[58,6,58,7],[55,6,55,7],[56,6,56,7],[57,6,57,7],[30,0,30,1],[31,0,31,1],[32,0,32,1],[30,6,30,7],[39,3,39,8],[52,6,52,7],[54,6,54,7],[53,6,53,7],[52,0,53,1],[32,6,32,7],[38,3,38,8],[49,0,49,1],[5,2,5,6],[20,1,20,5],[26,6,26,7],[6,2,6,4],[7,6,7,8],[7,2,7,4],[22,5,22,6],[22,7,22,8],[5,0,5,1],[6,0,6,1],[7,0,7,1],[14,7,14,8],[14,0,14,5],[17,0,19,8],[11,0,11,5],[16,0,16,5],[22,0,22,2],[26,0,26,1],[40,3,40,8],[32,2,32,3],[48,6,48,7],[29,0,29,1],[29,6,29,7],[27,0,27,1],[28,0,28,1],[27,6,27,7],[28,6,28,7],[31,6,31,7],[48,3,48,4],[34,0,34,8],[38,0,38,1],[50,0,50,1],[47,3,47,4],[33,0,33,8],[35,0,35,8],[39,0,39,1],[47,0,47,1],[48,0,48,1],[49,6,49,7],[50,6,50,7],[49,3,49,4],[50,3,50,4]]}
[]
["Honorar og rejseudlægsblanket"]
["Version 1.3"]
[]
["Personlige oplysninger: (felter markeret med * skal udfyldes)",null,null,null,null,null,{"$f":"IF(LEN(I6)>10,\"Bemærk: Cpr. nr. indeholder mere end 10 cifre.\",\"\")","v":""}]
["Navn: *",null,null,null,null,null,null,"Cpr. nr.: *"]
["Adresse: *",null,null,null,null,"Postnr.: *",null,"By:  *"]
["Tlf. nr.: *",null,null,null,null,"E-mail: *"]
["Udbetaling sker automatisk til Nemkonto",null,null,null,null,null,null,null,{"$f":"IF(I6=\"\",\"\",IFERROR(IF(MID(I5,7,1)=\"-\",IF(0=MOD(LEFT(I5)*4+MID(I5,2,1)*3+MID(I5,3,1)*2+MID(I5,4,1)*7+MID(I5,5,1)*6+MID(I5,6,1)*5+(MID(I5,8,1)*4+MID(I5,9,1)*3)+MID(I5,10,1)*2+MID(I5,11,1)*1,11),\"\",\"Cpr-nummer er ej gyldigt\"),IF(0=MOD(LEFT(I5)*4+MID(I5,2,1)*3+MID(I5,3,1)*2+MID(I5,4,1)*7+MID(I5,5,1)*6+MID(I5,6,1)*5+(MID(I5,7,1)*4+MID(I5,8,1)*3)+MID(I5,9,1)*2+MID(I5,10,1)*1,11),\"\",\"Cpr-nummer er ej gyldigt\")),\"Cpr-nummer er ej gyldigt\"))","v":""}]
[]
["Er du ansat i staten?*"]
[]
[]
["Navn på kontaktperson i Social- og Boligstyrelsen: *",null,null,null,null,null,null,"Projektnummer: *"]
[]
[]
["Honorar/rejseudlæg ydes for (beskrivelse samt dato for honorar/rejseudlæg): *"]
[]
[]
[]
[]
[]
["Honorar/rejseudlæg udbetales som (sæt X) *",null,null,"B-indkomst",{"$f":"IF(H23=\"\",\"x\",\"\")","v":"x"},"A-indkomst (Bikort)"]
["Honorar/rejseudlæg udbetales som udgangspunkt som B-Indkomst. Såfremt det skal udbetales som A-Indkomst sæt X i A-Indkomst."]
[]
[]
[null,null,"Finanskonto","Projektnummer","Skal udfyldes *",null,"Sats i kr. ",null,"Beløb"]
["Honorar 1)",null,227092,{"$f":"IF(H15=\"\",\"\",H15)","v":""},null,"Kr. ",null,null,{"$f":"E28","v":0}]
["Kørsel lav sats",null,221006,{"$f":"IF(D28=\"\",\"\",D28)","v":""},null,"Km á kr.:",2.23,null,{"$f":"E29*G29","v":0}]
["Kørsel høj sats 2)",null,221006,{"$f":"IF(D29=\"\",\"\",D29)","v":""},null,"Km á kr.:",3.79,null,{"$f":"E30*G30","v":0}]
["Transport",null,221006,{"$f":"IF(D30=\"\",\"\",D30)","v":""},null,"Kr. ",null,null,{"$f":"E31","v":0}]
["Hoteludgifter",null,221059,{"$f":"IF(D31=\"\",\"\",D31)","v":""},null,"Kr. ",null,null,{"$f":"E32","v":0}]
["Bilens reg. nr.",null,"Ved kørsel SKAL bilens registreringsnummer påføres",null,null,null,null,null,{"$f":"SUM(I28:I32)","v":0}]
["Ved henvendelse fra Social- og Boligstyrelsen skal modtager af honorar/rejseudlæg kunne dokumentere sine udgifter jf. BEK nr. 70 af 27/01/2011 -  bekendtgørelse om statens regnskabsvæsen mv. §44. Modtageren har pligt til at gemme dokumentationen i fem år fra aktivitetsdato.\n"]
["1) Vi gør opmærksom på, at du bør orientere dig i, om der gælder særlige regler vedr. din honorarindkomst, jf. bl.a. momslovens § 13 og § 45, stk. 1"]
["2) Kørsel til høj sats udbetales kun efter aftale med kontaktperson i Social- og Boligstyrelsen."]
[]
[]
[]
["Dato",null,null,"Underskrift - modtager af honorar/rejseudlæg "]
[null,null,null,"Ved returnering af blanketten til Social- og Boligstyrelsen via E-boks, godkendes blankettens indhold elektronisk - det er da ikke nødvendigt med en fysisk underskrift."]
[]
[]
[]
[]
["Til Social- og Boligstyrelsen",null,null,null,null,null,null,null,"PKAT 091"]
[]
["Lønkode",null,null,"Beløb/KM",null,"Lønkode",null,null,"Beløb"]
[6930,null,"Honorar (B-indkomst) - 1",{"$f":"IF(E23=\"X\",I28,0)","v":0},null,"2510-Sats 1","Honorar (A-indkomst) - 1",null,{"$f":"IF(H23=\"X\",I28,0)","v":0}]
["5305 - Sats 3",null,"Kørsel lav sats (KM) - 2",{"$f":"E29","v":0},null,4571,"Transport - 4",null,{"$f":"I31","v":0}]
["5305 - Sats 1",null,"Kørsel høj sats (KM) - 3",{"$f":"E30","v":0},null,4571,"Hoteludgifter mv. - 5",null,{"$f":"I32","v":0}]
[]
["Delregnskab",null,"Segm1","Segm2","Segm 3","Segm4","Segm5",null,"Segm6"]
[null,null,"(sidste 2 cifre i finanskontonummer)","(Projekt-nummer)","(Indkøbs-\nkategori)","(Sted)","(Bud.an)",null,"(FL-formål)"]
[1,{"$f":"IF(I28=0,\"\",IF(ISERROR(VLOOKUP($D$28,Testark!$A:$L,3,FALSE)),\"\",VLOOKUP($D$28,Testark!$A:$L,3,FALSE)))","v":""},92,{"$f":"IF(I28=0,\"\",IF(ISERROR(VLOOKUP($D$28,Testark!$A:$L,4,FALSE)),\"\",VLOOKUP($D$28,Testark!$A:$L,4,FALSE)))","v":""},null,{"$f":"IF(I28=0,\"\",IF(ISERROR(VLOOKUP($D$28,Testark!$A:$L,6,FALSE)),\"\",VLOOKUP($D$28,Testark!$A:$L,6,FALSE)))","v":""},{"$f":"IF(I28=0,\"\",IF(ISERROR(VLOOKUP($D$28,Testark!$A:$L,9,FALSE)),\"\",VLOOKUP($D$28,Testark!$A:$L,9,FALSE)))","v":""},null,{"$f":"IF(I28=0,\"\",IF(ISERROR(VLOOKUP($D$28,Testark!$A:$L,10,FALSE)),\"\",VLOOKUP($D$28,Testark!$A:$L,10,FALSE)))","v":""}]
[2,{"$f":"IF(I29=0,\"\",IF(ISERROR(VLOOKUP($D$28,Testark!$A:$L,3,FALSE)),\"\",VLOOKUP($D$28,Testark!$A:$L,3,FALSE)))","v":""},6,{"$f":"IF(I29=0,\"\",IF(ISERROR(VLOOKUP($D$28,Testark!$A:$L,4,FALSE)),\"\",VLOOKUP($D$28,Testark!$A:$L,4,FALSE)))","v":""},8310,{"$f":"IF(I29=0,\"\",IF(ISERROR(VLOOKUP($D$28,Testark!$A:$L,6,FALSE)),\"\",VLOOKUP($D$28,Testark!$A:$L,6,FALSE)))","v":""},{"$f":"IF(I29=0,\"\",IF(ISERROR(VLOOKUP($D$28,Testark!$A:$L,9,FALSE)),\"\",VLOOKUP($D$28,Testark!$A:$L,9,FALSE)))","v":""},null,{"$f":"IF(I29=0,\"\",IF(ISERROR(VLOOKUP($D$28,Testark!$A:$L,10,FALSE)),\"\",VLOOKUP($D$28,Testark!$A:$L,10,FALSE)))","v":""}]
[3,{"$f":"IF(I30=0,\"\",IF(ISERROR(VLOOKUP($D$28,Testark!$A:$L,3,FALSE)),\"\",VLOOKUP($D$28,Testark!$A:$L,3,FALSE)))","v":""},6,{"$f":"IF(I30=0,\"\",IF(ISERROR(VLOOKUP($D$28,Testark!$A:$L,4,FALSE)),\"\",VLOOKUP($D$28,Testark!$A:$L,4,FALSE)))","v":""},8310,{"$f":"IF(I30=0,\"\",IF(ISERROR(VLOOKUP($D$28,Testark!$A:$L,6,FALSE)),\"\",VLOOKUP($D$28,Testark!$A:$L,6,FALSE)))","v":""},{"$f":"IF(I30=0,\"\",IF(ISERROR(VLOOKUP($D$28,Testark!$A:$L,9,FALSE)),\"\",VLOOKUP($D$28,Testark!$A:$L,9,FALSE)))","v":""},null,{"$f":"IF(I30=0,\"\",IF(ISERROR(VLOOKUP($D$28,Testark!$A:$L,10,FALSE)),\"\",VLOOKUP($D$28,Testark!$A:$L,10,FALSE)))","v":""}]
[4,{"$f":"IF(I31=0,\"\",IF(ISERROR(VLOOKUP($D$28,Testark!$A:$L,3,FALSE)),\"\",VLOOKUP($D$28,Testark!$A:$L,3,FALSE)))","v":""},6,{"$f":"IF(I31=0,\"\",IF(ISERROR(VLOOKUP($D$28,Testark!$A:$L,4,FALSE)),\"\",VLOOKUP($D$28,Testark!$A:$L,4,FALSE)))","v":""},8310,{"$f":"IF(I31=0,\"\",IF(ISERROR(VLOOKUP($D$28,Testark!$A:$L,6,FALSE)),\"\",VLOOKUP($D$28,Testark!$A:$L,6,FALSE)))","v":""},{"$f":"IF(I31=0,\"\",IF(ISERROR(VLOOKUP($D$28,Testark!$A:$L,9,FALSE)),\"\",VLOOKUP($D$28,Testark!$A:$L,9,FALSE)))","v":""},null,{"$f":"IF(I31=0,\"\",IF(ISERROR(VLOOKUP($D$28,Testark!$A:$L,10,FALSE)),\"\",VLOOKUP($D$28,Testark!$A:$L,10,FALSE)))","v":""}]
[5,{"$f":"IF(I32=0,\"\",IF(ISERROR(VLOOKUP($D$28,Testark!$A:$L,3,FALSE)),\"\",VLOOKUP($D$28,Testark!$A:$L,3,FALSE)))","v":""},59,{"$f":"IF(I32=0,\"\",IF(ISERROR(VLOOKUP($D$28,Testark!$A:$L,4,FALSE)),\"\",VLOOKUP($D$28,Testark!$A:$L,4,FALSE)))","v":""},8210,{"$f":"IF(I32=0,\"\",IF(ISERROR(VLOOKUP($D$28,Testark!$A:$L,6,FALSE)),\"\",VLOOKUP($D$28,Testark!$A:$L,6,FALSE)))","v":""},{"$f":"IF(I32=0,\"\",IF(ISERROR(VLOOKUP($D$28,Testark!$A:$L,9,FALSE)),\"\",VLOOKUP($D$28,Testark!$A:$L,9,FALSE)))","v":""},null,{"$f":"IF(I32=0,\"\",IF(ISERROR(VLOOKUP($D$28,Testark!$A:$L,10,FALSE)),\"\",VLOOKUP($D$28,Testark!$A:$L,10,FALSE)))","v":""}]

{"sheet":"Ark1","index":1,"n_rows":3,"n_cols":1,"rows_kept":3,"cut":false,"hidden":true,"merged":[]}
[]
["Ja "]
["Nej "]

{"sheet":"Alias","index":2,"n_rows":661,"n_cols":16,"rows_kept":661,"cut":false,"hidden":true,"merged":[]}
["Alias","Beskrivelse","Kontotype","Kontonr.","Delregnskab kode","Projektnummer Kode","Aktivitet kode","Sted kode","Projekt Kode","Indkoebskategori Kode","Budgetansvar Kode","FL-FORMÅL Kode","Sagsbeskrivelse","Sagsopgavebeskrivelse","Spærret","Rettet den"]
[10001,"Bevilling FL 12dels rater mv."," ",null,174,10001,null,"<BLANK>",null,null,null,810,null,null,"Nej","2020-07-28"]
[10002,"Personaleomkostninger"," ",null,174,10002,null,"<BLANK>",null,null,null,810,null,null,"Nej","2017-05-22"]
[10011,"Generel ledelse"," ",null,174,10011,null,"<BLANK>",null,null,null,940,null,null,"Nej","2017-05-22"]
[10021,"Driftsmæssigunderstøttelse"," ",null,174,10021,null,"<BLANK>",null,null,null,810,null,null,"Nej","2017-05-22"]
[10031,"Kompetenceudvikling"," ",null,174,10031,10031,"<BLANK>",550,null,null,940,null,null,"Nej","2017-05-22"]
[10041,"TR, AMIR og  MIO"," ",null,174,10041,null,"<BLANK>",null,null,null,810,null,null,"Nej","2017-05-22"]
[10051,"Kontormøder"," ",null,174,10051,null,"<BLANK>",null,null,null,940,null,null,"Nej","2017-05-22"]
[10061,"Satspuljearbejde og departementsbetjening"," ",null,174,10061,null,"<BLANK>",null,null,null,104,null,null,"Nej","2017-05-22"]
[10071,"Kontorramme"," ",null,174,10071,null,"<BLANK>",null,null,null,940,null,null,"Nej","2017-05-22"]
[10101,"Øvrig GB TIKO FL-formål 101"," ",null,174,10101,null,51,null,null,null,101,null,null,"Nej","2017-05-22"]
[10102,"Øvrig GB TIKO FL-formål 102"," ",null,174,10102,null,51,null,null,null,102,null,null,"Nej","2017-05-22"]
[10103,"Øvrig GB TIKO FL-formål 103"," ",null,174,10103,null,51,null,null,null,103,null,null,"Nej","2017-05-22"]
[10104,"Øvrig GB TIKO FL-formål 104"," ",null,174,10104,null,51,null,null,null,104,null,null,"Nej","2017-05-22"]
[10105,"Øvrig GB TIKO FL-formål 105"," ",null,174,10105,null,51,null,null,null,105,null,null,"Nej","2017-05-22"]
[10106,"Øvrig GB TIKO FL-formål 106"," ",null,174,10106,null,51,null,null,null,106,null,null,"Nej","2017-05-22"]
[10111,"Øvrig GB CDAM FL-formål 101"," ",null,174,10111,null,52,null,null,null,101,null,null,"Nej","2017-05-22"]
[10112,"Øvrig GB CDAM FL-formål 102"," ",null,174,10112,null,52,null,null,null,102,null,null,"Nej","2017-05-22"]
[10113,"Øvrig GB CDAM FL-formål 103"," ",null,174,10113,null,52,null,null,null,103,null,null,"Nej","2017-05-22"]
[10114,"Øvrig GB CDAM FL-formål 104"," ",null,174,10114,null,52,null,null,null,104,null,null,"Nej","2017-05-22"]
[10115,"Øvrig GB CDAM FL-formål 105"," ",null,174,10115,null,52,null,null,null,105,null,null,"Nej","2017-05-22"]
[10116,"Øvrig GB CDAM FL-formål 106"," ",null,174,10116,null,52,null,null,null,106,null,null,"Nej","2017-05-22"]
[10121,"Øvrig GB CBUF FL-formål 101"," ",null,174,10121,null,53,null,null,null,101,null,null,"Nej","2017-05-22"]
[10122,"Øvrig GB CBUF FL-formål 102"," ",null,174,10122,10122,53,550,null,null,102,null,null,"Nej","2017-05-22"]
[10123,"Øvrig GB CBUF FL-formål 103"," ",null,174,10123,null,53,null,null,null,103,null,null,"Nej","2017-05-22"]
[10124,"Øvrig GB CBUF FL-formål 104"," ",null,174,10124,null,53,null,null,null,104,null,null,"Nej","2017-05-22"]
[10125,"Øvrig GB CBUF FL-formål 105"," ",null,174,10125,null,53,null,null,null,105,null,null,"Nej","2017-05-22"]
[10126,"Øvrig GB CBUF FL-formål 106"," ",null,174,10126,null,53,null,null,null,106,null,null,"Nej","2017-05-22"]
[10131,"Øvrig GB VISO FL-formål 101"," ",null,174,10131,null,55,null,null,null,101,null,null,"Nej","2017-05-22"]
[10132,"Øvrig GB VISO FL-formål 102"," ",null,174,10132,null,55,null,null,null,102,null,null,"Nej","2017-05-22"]
[10133,"Øvrig GB VISO FL-formål 103"," ",null,174,10133,null,55,null,null,null,103,null,null,"Nej","2017-05-22"]
[10134,"Øvrig GB VISO FL-formål 104"," ",null,174,10134,null,55,null,null,null,104,null,null,"Nej","2017-05-22"]
[10135,"Øvrig GB VISO FL-formål 105"," ",null,174,10135,null,55,null,null,null,105,null,null,"Nej","2017-05-22"]
[10136,"Øvrig GB VISO FL-formål 106"," ",null,174,10136,null,55,null,null,null,106,null,null,"Nej","2017-05-22"]
[10141,"Øvrig GB CH FL-formål 101"," ",null,174,10141,null,71,null,null,null,101,null,null,"Nej","2018-08-17"]
[10142,"Øvrig GB CH FL-formål 102"," ",null,174,10142,null,71,null,null,null,102,null,null,"Nej","2018-08-17"]
[10143,"Øvrig GB CH FL-formål 103"," ",null,174,10143,null,71,null,null,null,103,null,null,"Nej","2018-08-17"]
[10144,"Øvrig GB CH FL-formål 104"," ",null,174,10144,null,71,null,null,null,104,null,null,"Nej","2018-08-17"]
[10145,"Øvrig GB CH FL-formål 105"," ",null,174,10145,null,71,null,null,null,105,null,null,"Nej","2018-08-17"]
[10146,"Øvrig GB CH FL-formål 106"," ",null,174,10146,null,71,null,null,null,106,null,null,"Nej","2018-08-17"]
[10151,"Øvrig GB CUV FL-formål 101"," ",null,174,10151,null,64,null,null,null,101,null,null,"Nej","2017-05-22"]
[10152,"Øvrig GB CUV FL-formål 102"," ",null,174,10152,null,64,null,null,null,102,null,null,"Nej","2017-05-22"]
[10153,"Øvrig GB CUV FL-formål 103"," ",null,174,10153,null,64,null,null,null,103,null,null,"Nej","2017-05-22"]
[10154,"Øvrig GB CUV FL-formål 104"," ",null,174,10154,null,64,null,null,null,104,null,null,"Nej","2017-05-22"]
[10155,"Øvrig GB CUV FL-formål 105"," ",null,174,10155,null,64,null,null,null,105,null,null,"Nej","2017-05-22"]
[10156,"Øvrig GB CUV FL-formål 106"," ",null,174,10156,null,64,null,null,null,106,null,null,"Nej","2017-05-22"]
[10161,"Øvrig GB CPS FL-formål 101"," ",null,174,10161,null,72,null,null,null,101,null,null,"Nej","2018-01-29"]
[10162,"Øvrig GB CPS FL-formål 102"," ",null,174,10162,null,72,null,null,null,102,null,null,"Nej","2018-01-29"]
[10163,"Øvrig GB CPS FL-formål 103"," ",null,174,10163,null,72,null,null,null,103,null,null,"Nej","2018-01-29"]
[10164,"Øvrig GB CPS FL-formål 104"," ",null,174,10164,null,72,null,null,null,104,null,null,"Nej","2018-01-29"]
[10165,"Øvrig GB CPS FL-formål 105"," ",null,174,10165,null,72,null,null,null,105,null,null,"Nej","2018-01-29"]
[10166,"Øvrig GB CPS FL-formål 106"," ",null,174,10166,null,72,null,null,null,106,null,null,"Nej","2018-01-29"]
[10191,"Koordination af specialrådgivningen (KaS)"," ",null,174,10191,null,55,null,null,552,103,null,null,"Nej","2017-05-22"]
[10201,"Søgefunktion "," ",null,174,10201,null,52,null,null,522,101,null,null,"Nej","2017-05-22"]
[10221,"Ungdomssanktionen 52303 (UR)"," ",null,174,10221,null,53,null,null,535,101,null,null,"Nej","2017-05-22"]
[10261,"VIAS rådgivning/drift"," ",null,174,10261,null,55,null,null,552,103,null,null,"Nej","2019-03-08"]
[10302,"VISO-rådgivning - ud af huset"," ",null,174,10302,null,55,null,null,552,103,null,null,"Nej","2019-01-08"]
[10303,"VISO-rådgivning - inhouse"," ",null,174,10303,null,55,null,null,552,103,null,null,"Nej","2019-01-08"]
[10304,"VISO-rådgivning - inhouse på tværs af forløb"," ",null,174,10304,null,55,null,null,552,103,null,null,"Nej","2019-01-08"]
[10305,"VISO-kvalitetsudvikling"," ",null,174,10305,null,55,null,null,552,103,null,null,"Nej","2019-01-08"]
[10306,"VISO-leverandørstyring"," ",null,174,10306,null,55,null,null,552,103,null,null,"Nej","2019-01-08"]
[10307,"VISO-vidensproduktion"," ",null,174,10307,null,55,null,null,552,103,null,null,"Nej","2019-01-08"]
[10331,"Kompetencecenter, prositution"," ",null,174,10331,null,64,null,null,643,101,null,null,"Nej","2017-05-22"]
[10412,"SOTI - Audit drift"," ",null,174,10412,null,51,null,null,512,105,null,null,"Nej","2017-05-22"]
[10414,"NATKO - Specialeplaner - spor 2"," ",null,174,10414,null,51,null,null,512,105,null,null,"Nej","2020-04-23"]
[10415,"NATKO - Specialeplaner - spor 3"," ",null,174,10415,null,51,null,null,512,101,null,null,"Nej","2021-01-05"]
[10451,"Udbud af VISOs ydelser"," ",null,174,10451,null,55,null,null,552,103,null,null,"Nej","2017-05-22"]
[10491,"VIAS - drift"," ",null,174,10491,null,25,null,null,252,103,null,null,"Nej","2017-05-22"]
[10531,"ESDH-drift og support"," ",null,174,10531,null,25,null,null,252,940,null,null,"Nej","2017-05-22"]
[10541,"IT-sikkerhed"," ",null,174,10541,null,25,null,null,252,940,null,null,"Nej","2021-01-14"]
[10551,"Support"," ",null,174,10551,null,25,null,null,252,940,null,null,"Nej","2017-05-22"]
[10561,"IT-analyser"," ",null,174,10561,null,25,null,null,252,940,null,null,"Nej","2018-07-02"]
[10581,"Internet/Intranet"," ",null,174,10581,null,25,null,null,252,940,null,null,"Nej","2017-05-22"]
[10591,"IT-licenser"," ",null,174,10591,null,25,null,null,252,940,null,null,"Nej","2017-05-22"]
[10601,"Fjernprint"," ",null,174,10601,null,25,null,null,252,940,null,null,"Nej","2017-05-22"]
[10611,"Ministerieordningen"," ",null,174,10611,null,52,null,null,522,101,null,null,"Nej","2017-05-22"]
[10631,"Statens IT"," ",null,174,10631,null,25,null,null,252,940,null,null,"Nej","2019-10-04"]
[10661,"SSP-uddannelse"," ",null,111,10661,null,53,null,null,535,102,null,null,"Nej","2020-02-20"]
[10681,"Standardisering "," ",null,174,10681,null,71,null,null,713,102,null,null,"Nej","2017-05-22"]
[10711,"Trivselsundersøgelse blandt anbragte børn"," ",null,174,10711,null,13,null,null,132,101,null,null,"Nej","2021-01-05"]
{"$rows_left_out":582}
{"sheet":"Testark","index":3,"n_rows":2777,"n_cols":12,"rows_kept":2777,"cut":false,"hidden":true,"merged":[]}
["Alias","Beskrivelse","Delregnskab kode","Projektnummer Kode","Aktivitet kode","Sted kode","Projekt Kode","Indkoebskategori Kode","Budgetansvar Kode","FL-FORMÅL Kode","Spærret","Rettet den"]
[10001,"Bevilling FL 12dels rater mv.",174,10001,null,"<BLANK>",null,null,null,810,"Nej","2022-02-01"]
[10002,"Personaleomkostninger",174,10002,null,"<BLANK>",null,null,null,810,"Nej","2017-05-22"]
[10010,"Ejendom Fælles",174,null,10010,20,550,null,null,940,"Ja","2017-05-22"]
[100101,"Sociale Akuttilbud",97,null,100101,63,41001,null,null,102,"Ja","2017-05-22"]
[100107,"Sats 2014, Peerstøtte afprøvning (ADM)",174,null,100107,63,554,null,null,102,"Ja","2017-05-22"]
["10010-900","Ejendom Åbenrå 5, 1125 Kbh. k.",174,null,10010,20,900,null,null,940,"Ja","2020-03-26"]
["10010-907","Ejendom Sohngårdsholmsvej 61, 9000 Aalborg",174,null,10010,20,907,null,null,940,"Ja","2017-05-22"]
["10010-908","Ejendom Buchwaldsgade, Odense",174,null,10010,20,908,null,null,940,"Ja","2017-05-22"]
["10010-912","Ejendom Skibhusvej 52 B, 1. sal, 5000 Odense C.",174,null,10010,20,912,null,null,940,"Ja","2017-05-22"]
["10010-913","Ejendom Skibhusvej 52 B, 3. sal, 5000 Odense C.",174,null,10010,20,913,null,null,940,"Ja","2017-05-22"]
["10010-916","Ejendom Edisonsvej 18, 1. sal, 5000 Odense C.",174,null,10010,20,916,null,null,940,"Ja","2017-05-22"]
["10010-918","Ejendom Skibhusvej 52 B, stuen, 5000 Odense C.",174,null,10010,20,918,null,null,940,"Ja","2017-05-22"]
["10010-919","Ejendom Landemærket 9, 1119 København K.",174,null,10010,20,919,null,null,940,"Ja","2017-05-22"]
["10010-923","Ejendom Degnevej 16, 6700 Esbjerg",174,null,10010,20,923,null,null,940,"Ja","2017-05-22"]
["10010-924","Ejendom Ryesgade 1, 8000 Århus C",174,null,10010,20,924,null,null,940,"Ja","2017-05-22"]
["10010-925","Ejendom Landemærket 29",174,null,10010,20,925,null,null,940,"Ja","2017-05-22"]
["10010-926","Ejendom nyt lejemål Kbh",174,null,10010,20,926,null,null,940,"Ja","2017-05-22"]
["10010-927","Ejendom Åbenrå, Den Nationale Tolkemyndighed",174,null,10010,20,927,null,null,940,"Ja","2017-05-22"]
["10010-928","Ejendom Colbjørnsensgade",174,null,10010,20,928,null,null,940,"Ja","2017-05-22"]
["10010-929","Ejendom Edisonsvej 1, 5000 Odense C.",174,null,10010,20,929,null,null,940,"Ja","2017-05-22"]
[10011,"Generel ledelse",174,10011,null,"<BLANK>",null,null,null,940,"Nej","2017-05-22"]
["100111-BH","Ekstr. Udg. rådgivning og opkvalificering",97,null,100111,54,117,null,null,103,"Ja","2017-05-22"]
["100112-BH","EXTR tilpas. kurser årsmøde borgm&politi",97,null,100112,54,117,null,null,103,"Ja","2017-05-22"]
["100113-BH","EXTR tilpassede kurser opsamling SSP",97,null,100113,54,117,null,null,103,"Ja","2017-05-22"]
["100114-BH","EXTR tilpassede kurser rejser interne",97,null,100114,54,117,null,null,103,"Ja","2017-05-22"]
["100115-BH","EXTR tilpassede kurser tryk håndbøger",97,null,100115,54,117,null,null,103,"Ja","2017-05-22"]
["100118-BH","Ekstremisme Undervisningspakken",97,null,100118,54,117,null,null,103,"Ja","2017-05-22"]
["10011-951","Ombygning direktørkontor, Odense",174,null,10011,20,951,null,null,940,"Ja","2017-05-22"]
["10011-952","Ombygning mødelokale, Odense",174,null,10011,20,952,null,null,940,"Ja","2017-05-22"]
["10011-953","Ombygning Landemærket, Kbh",174,null,10011,20,953,null,null,940,"Ja","2017-05-22"]
["10011-954","Ombygning Åbenrå, Kbh",174,null,10011,20,954,null,null,940,"Ja","2017-05-22"]
["100119-BH","EXTR Undervisningspakke øvrige omk",97,null,100119,54,31440,null,null,103,"Ja","2017-05-22"]
["100122-BH","Ekstremisme: Hadforbrydelse",97,null,100122,54,117,null,null,103,"Ja","2017-05-22"]
["100126-BH","Ekstremisme: Forebyggelseskonceptet",97,null,100126,54,117,null,null,103,"Ja","2017-05-22"]
["100127-BH","EXTR Syrien forældrekursus II",97,null,100127,54,117,null,null,103,"Ja","2017-05-22"]
["100128-BH","EXTR Syrien netværksmøder",97,null,100128,54,117,null,null,103,"Ja","2017-05-22"]
["100129-BH","EXTR Syrien rejser",97,null,100129,54,117,null,null,103,"Ja","2017-05-22"]
["100130-BH","EXTR Syrien forældrepjece",97,null,100130,54,117,null,null,103,"Ja","2017-05-22"]
["100133-BH","EXTR",97,null,100133,54,117,null,null,103,"Ja","2017-05-22"]
["100134-BH","EXTR PSP opmærksomhedsoplæg",97,null,100134,54,117,null,null,103,"Ja","2017-05-22"]
["100135-BH","EXTR PSP rejser",97,null,100135,54,6533,null,null,103,"Ja","2017-05-22"]
["100136-BH","EXTR PSP medie/trykning",97,null,100136,54,117,null,null,103,"Ja","2017-05-22"]
["100137-BH","EXTR PSP ekstern evaluering",97,null,100137,54,117,null,null,103,"Ja","2017-05-22"]
["100140-BH","Ekstremisme: Somalia",97,null,100140,54,117,null,null,103,"Ja","2017-05-22"]
["100141-BH","EXTR Somalia medie/trykning",97,null,100141,54,117,null,null,103,"Ja","2017-05-22"]
["100142-BH","EXTR Somalia international ungdomskonference",97,null,100142,53,117,null,null,103,"Ja","2017-05-22"]
["100143-BH","EXTR Somalia rejser",97,null,100143,54,117,null,null,103,"Ja","2017-05-22"]
[100146,"Hjemløsestrategien - Foranskring 2014-2015",97,null,100146,64,33970,null,null,102,"Ja","2017-05-22"]
[10015,"Etablering samlet lokation Kbh",174,null,10015,20,550,null,null,940,"Ja","2017-05-22"]
[100150,"Forebyggelse af magtanvendelse",97,null,100150,63,66001,null,null,101,"Ja","2017-05-22"]
[100153,"Forebyg. til bevarelse af funkt.evnen hos ældre",97,null,100153,65,11209,null,null,101,"Ja","2017-05-22"]
[100160,"Metodeprogram for stofmisbrugsbehandling",97,null,100160,64,33980,null,null,101,"Ja","2017-05-22"]
[100164,"Mestringskurser tilpasning af programmer",97,null,100164,63,41002,null,null,101,"Ja","2017-05-22"]
[100167,"Indsatser på botilbud - vidensindsamling",97,null,100167,63,41003,null,null,102,"Ja","2017-05-22"]
[100170,"Mestringspakken - kortlægning",97,null,100170,63,33990,null,null,102,"Ja","2017-05-22"]
[100174,"Mestringspakken - kortlægning ADM",174,null,100174,63,554,null,null,102,"Ja","2017-05-22"]
[100177,"Frivillig faglighed - videns og metodeafsøgn.",97,null,100177,62,46023,null,null,102,"Ja","2017-05-22"]
[100178,"Frivillig faglighed - processtøtte",97,null,100178,63,46028,null,null,102,"Ja","2017-05-22"]
[100181,"SidLigGodt konference",90,null,100181,61,9530,null,null,102,"Ja","2017-05-22"]
[100186,"Konsulentydelser - BHT",90,null,100186,61,9540,null,null,103,"Ja","2017-05-22"]
[100187,"Odense Kommune (rehabilitering)",90,null,100187,61,9540,null,null,103,"Ja","2017-05-22"]
[100188,"VIS",90,null,100188,61,9540,null,null,103,"Ja","2017-05-22"]
[100189,"IT til tiden",90,null,100189,61,9540,null,null,103,"Ja","2017-05-22"]
[100190,"Mindre konsulentopgaver",90,null,100190,61,9540,null,null,103,"Ja","2017-05-22"]
[100197,"Inspirationsmateriale - træningsindsatser",97,null,100197,63,41004,null,null,102,"Ja","2017-05-22"]
[100198,"Inspirationsmateriale - litteraturanalyse",97,null,100198,63,41004,null,null,102,"Ja","2017-05-22"]
[10020,"Kopimaskiner & printere - drift",174,null,10020,20,550,null,null,940,"Ja","2017-05-22"]
[100201,"Dok. metoder i bostøtteindsatsen",97,null,100201,63,66002,null,null,102,"Ja","2017-05-22"]
[100204,"Overgang fra barn til voksen",174,null,100204,66,554,null,null,101,"Ja","2017-05-22"]
[100207,"Sociale Akuttilbud - ADM",174,null,100207,63,554,null,null,102,"Ja","2017-05-22"]
[10021,"Driftsmæssigunderstøttelse",174,10021,null,"<BLANK>",null,null,null,810,"Nej","2017-05-22"]
[100210,"Forebyggelse af magtanvendelse ADM",174,null,100210,63,554,null,null,101,"Ja","2017-05-22"]
[100213,"Indsatser på botilbud - implementering",97,null,100213,63,41005,null,null,102,"Ja","2017-05-22"]
[100216,"Indsatser på botilbud - evaluering",97,null,100216,63,41006,null,null,101,"Ja","2017-05-22"]
[100219,"Metodeprogrammet \"Viden der virker\"",97,null,100219,64,34050,null,null,102,"Ja","2017-05-22"]
[10022,"Kopimaskiner & printere - indkøb",174,null,10022,20,550,null,null,940,"Ja","2017-05-22"]
[100223,"Faglig ledelse og ledelsesinformation (ADM)",174,null,100223,53,554,null,null,101,"Ja","2017-05-22"]
[100231,"Frivillig faglighed - udvikling af datakoncept.",97,null,100231,62,46024,null,null,102,"Ja","2017-05-22"]
[100237,"Koordineret indsatsplaner",174,null,100237,63,550,null,null,102,"Ja","2017-05-22"]
{"$rows_left_out":2697}